{"text_format":"1","workbook":"xlsx","n_sheets":5,"sheets":["Input","Sheet1","PartsData","LookupLists","MyLinks"],"not_rendered":{"charts":0,"images":1,"macros":1,"external_links":0,"defined_names":12,"comments":1,"pivot_tables":1},"unopened":[],"bounds":{"document_bytes":16777216,"sheet_cells":100000,"rows_first":2000,"rows_last":500,"rows_between":2000,"halvings":0,"cell_chars":16384,"cell_head_chars":4096},"cells_cut":0,"cells_raw":0,"read":"whole","date_system":"1900"}

{"sheet":"Input","index":0,"n_rows":89,"n_cols":12,"rows_kept":89,"cut":false,"hidden":false,"merged":[]}
[null,null,null,null,"HIDE COLUMNS",null,null,null,null,"I","HIDE","HIDE"]
[null,null,null,null,null,null,null,null,null,null,"Rec#","In Db"]
[null,"Registro de Recibo de Producto",null,null,null,null,null,null,null,null,{"$f":"IF(ISERROR(MATCH(OrderSel,OrderIDList,0)),0,MATCH(OrderSel,OrderIDList,0))","v":0},{"$f":"AND(OrderID<>\"\",COUNTIF(PartsData!C$1:C$549,OrderID)>0)","v":false}]
[null,null,null,null,"Req'd","Test"]
[null,"# Numero Lot",null,null,"x",{"$f":"IF(E5=\"\",\"\",IF(D5=\"\",1,\"\"))","v":1},null,null,"View Records"]
[null,"# Documento",null,null,"x",null,null,0,"of ",{"$f":"COUNTA(PartsData!A2:A200)","v":134}]
[null,"Centro de Acopio",null,null,null,""]
[null,"Fecha",null,null,null,""]
[null,"#CVO",null,{"$f":"VLOOKUP(D7,LookupLists!A2:D11,2,FALSE)","v":{"$error":"#N/A"}},null,""]
[null,"#SIREA",null,{"$f":"VLOOKUP(D7,LookupLists!A2:D11,3,FALSE)","v":{"$error":"#N/A"}},null,""]
[null,"#INCOPESCA",null,{"$f":"VLOOKUP(D7,LookupLists!A2:D11,4,FALSE)","v":{"$error":"#N/A"}},null,""]
[null,"Nombre del Pescador"]
[null,"Licencia de Pesca",null,{"$f":"VLOOKUP(D12,LookupLists!E2:H42,2,FALSE)","v":{"$error":"#N/A"}}]
[null,"Nombre de la Embarcación",null,{"$f":"VLOOKUP(D12,LookupLists!E2:H42,3,FALSE)","v":{"$error":"#N/A"}}]
[null,"# de Matrícula",null,{"$f":"VLOOKUP(D12,LookupLists!E2:H42,4,FALSE)","v":{"$error":"#N/A"}}]
[null,"Arte de Pesca"]
[null,"Horas o Días de Pesca"]
[null,"# de Pescadores"]
[null,"Area de Pesca"]
[null,"Nombre Común 1"]
[null,"Nombre Científico 1",null,{"$f":"VLOOKUP(D20,LookupLists!K2:M168,2,FALSE)","v":{"$error":"#N/A"}}]
[null,"Clasificación 1",null,{"$f":"VLOOKUP(D20,LookupLists!K2:M168,3,FALSE)","v":{"$error":"#N/A"}}]
[null,"Cantidad 1"]
[null,"Nombre Común 2"]
[null,"Nombre Científico 2",null,{"$f":"VLOOKUP(D24,LookupLists!K2:M168,2,FALSE)","v":{"$error":"#N/A"}}]
[null,"Clasificación 2",null,{"$f":"VLOOKUP(D24,LookupLists!K2:M168,3,FALSE)","v":{"$error":"#N/A"}}]
[null,"Cantidad 2"]
[null,"Nombre Común 3"]
[null,"Nombre Científico 3",null,{"$f":"VLOOKUP(D28,LookupLists!K2:M168,2,FALSE)","v":{"$error":"#N/A"}}]
[null,"Clasificación 3",null,{"$f":"VLOOKUP(D28,LookupLists!K2:M168,3,FALSE)","v":{"$error":"#N/A"}}]
{"$rows_left_out":60}
{"sheet":"Sheet1","index":1,"n_rows":191,"n_cols":6,"rows_kept":191,"cut":false,"hidden":true,"merged":[]}
[]
[]
[null,"Values"]
["Row Labels","Count of Cantidad 1","Count of Cantidad 2","Count of Cantidad 3","Count of Cantidad 4","Count of Cantidad 5"]
["13/02/14",4,4]
["13/12/13",5]
["14/01/14",2,1]
["14/12/13",2,2]
["15/01/14",1]
["15/10/13",4,3]
["16/01/14",2,2]
["16/02/14",2,2]
["16/10/13",4,2]
["16/12/13",3,1]
["17/01/14",2]
["17/10/13",2,1]
["17/12/13",1,1]
["18/01/14",2]
["18/02/14",1,1]
["18/10/13",3,1]
["18/12/13",2,2]
["19/01/14",1]
["19/10/13",1,1]
["19/12/13",1]
["20/01/14",1,1]
["20/10/13",3,3,1]
["21/01/14",1]
["21/12/13",3]
["22/01/14",2,1]
["22/10/13",1]
{"$rows_left_out":162}
{"sheet":"PartsData","index":2,"n_rows":540,"n_cols":47,"rows_kept":540,"cut":false,"hidden":false,"merged":[]}
["Tiempo de Entrar","Nombre de Entrada","# Numero Lot","# Documento","Centro de Acopio","Fecha","#CVO","#SIREA","#INCOPESCA","Nombre de Pescador","Licencia de Pesca","Nombre de Embarcación","# Matrícula","Arte de Pesca"," Horas o Días De Pesca","# de Pescadores","Area de Pesca","Nombre Común 1","Nombre CientÍfico 1","Clasificación 1","Cantidad 1","Nombre Común 2","Nombre CientÍfico 2","Clasificación 2","Cantidad 2","Nombre Común 3","Nombre CientÍfico 3","Clasificación 3","Cantidad 3","Nombre Común 4","Nombre CientÍfico 4","Clasificación 4","Cantidad 4","Nombre Común 5","Nombre CientÍfico 5","Clasificación 5","Cantidad 5","Recibo 1","Almacenaje 1","Despacho 1","Recibo 2","Almacenaje 2","Despacho 2","Nombre Responsable","Fecha2","Verifcador","Fecha 3"]
["2014-04-22T12:21:50","Lina Tran","01-28801-03-01",1,"Recibidor de Mariscos Don Chino","2013-10-15","082027-01",0,"PC-012-01","Francisco Jiron Arias","H-0088-98PTS-2064-12","La Nira III","11309 PP","Cuerda","5 H",2,"Las Corteza, Golfo de Nicoya","Corvina reina","Cynoscion albus","P.G. ",3.3,"Corvina pequena",null,"P.P. ",2.6,null,{"$error":"#N/A"},{"$error":"#N/A"},null,null,null,{"$error":"#N/A"},null,null,{"$error":"#N/A"},{"$error":"#N/A"},null,"Fresco",2,2,"Fresco",2,2,"Mabiel Herrera","2013-10-15","Mabiel Herrera","2013-10-15"]
[null,null,"01-28813-01-01",2,"Recibidor de Mariscos Don Chino","15/10/13","082027-01",0,"PC-012-01","Denis Sanchez Peña","P-0412-10-PTS","Dany S.","10975 PP","Cuerda","5 H",2,"Las Corteza, Golfo de Nicoya","Corvina pequena",null,"P.P.",3.9,"Corvina reina",null,"P.G.",7.8,null,null,null,null,null,null,null,null,null,null,null,null,"Fresco",2,2,"Fresco",2,2,"Mabiel Herrera","15/10/13","Mabiel Herrera ","15/10/13"]
[null,null,"01-28813-06-01",3,"Recibidor de Mariscos Don Chino","15/10/13","082027-01",0,"PC-012-01","Luis D. Herrera","H-0014-03-PTS-1997-12","Don Chino","11107 PP","Cuerda","6 H",2,"Las Corteza, Golfo de Nicoya","Corvina reina",null,"P.G.",14.2,"Corvina pequena",null,"P.P.",7.6,null,null,null,null,null,null,null,null,null,null,null,null,"Fresco",2,2,"Fresco",3,2,"Mabiel Herrera","15/10/13","Mabiel Herrera ","15/10/13"]
[null,null,"01-28812-05-01",4,"Recibidor de Mariscos Don Chino","15/10/13","082027-01",0,"PC-012-01","Ana C. Villareal Brenes","H-0515-08PTS-227-12","Olamar Yes","P012137","Cuerda","6 H",2,"Las Corteza, Golfo de Nicoya","Corvina reina",null,"P.G.",5.5,null,null,null,null,null,null,null,null,null,null,null,null,null,null,null,null,"Fresco",3,2,"Fresco",3,2,"Mabiel Herrera","15/10/13","Mabiel Herrera ","15/10/13"]
[null,null,"01-28813-09-01",5,"Recibidor de Mariscos Don Chino","15/10/13","082027-01",0,"PC-012-01","Juan Jose Perez","H-0039-97PTS-1325-11","Katy IV","10018 PP","Cuerda","5 H",2,"Las Corteza, Golfo de Nicoya","Corvina reina",null,"P.G.",3.5,"Corvina pequena",null,"P.P.",7.8,null,null,null,null,null,null,null,null,null,null,null,null,"Fresco",2,2,"Fresco",2,2,"Mabiel Herrera","15/10/13","Mabiel Herrera ","15/10/13"]
[null,null,"01-28913-10-01",6,"Recibidor de Mariscos Don Chino","16/10/13","082027-01",0,"PC-012-01","Maximilliano Peña","H-0079-79PTS-2061-12","La Pulga P.","9706 PP","Cuerda","6 H",2,"Las Corteza, Golfo de Nicoya","Corvina reina",null,"P.G.",10.5,"Corvina pequena",null,"P.P.",0.6,null,null,null,null,null,null,null,null,null,null,null,null,"Fresco",3,2,"Fresco",3,2,"Mabiel Herrera","16/10/13","Mabiel Herrera ","16/10/13"]
[null,null,"01-28913-07-01",7,"Recibidor de Mariscos Don Chino","16/10/13","082027-01",0,"PC-012-01","Alexander Chavarra","H-0809-12-PTS","Rosaly","11120 PP","Cuerda","5 H",2,"Las Corteza, Golfo de Nicoya","Corvina pequena",null,"P.P.",3.5,null,null,null,null,null,null,null,null,null,null,null,null,null,null,null,null,"Fresco",2,3,"Fresco",2,2,"Mabiel Herrera","16/10/13","Mabiel Herrera ","16/10/13"]
[null,null,"01-28913-09-01",8,"Recibidor de Mariscos Don Chino","16/10/13","082027-01",0,"PC-012-01","Juan Jose Perez","H-0039-97PTS-1325-11","Katy IV","10018 PP","Cuerda","5 H",3,"Las Corteza, Golfo de Nicoya","Pargo Rojo",null,"Pargo",9.6999999999999993,null,null,null,null,null,null,null,null,null,null,null,null,null,null,null,null,"Fresco",2,2,"Fresco",2,3,"Mabiel Herrera","16/10/13","Mabiel Herrera ","16/10/13"]
[null,null,"01-28913-03-01",9,"Recibidor de Mariscos Don Chino","16/10/13","082027-01",0,"PC-012-01","Baudilio Barrantes Jiminez","H-0028-94PTS-2048-12","Talolinga","6554 PP","Cuerda","6 H",2,"Las Corteza, Golfo de Nicoya","Corvina reina",null,"P.G.",null,null,null,null,null,null,null,null,null,null,null,null,null,null,null,null,null,"Fresco",3,2,"Fresco",2,3,"Mabiel Herrera","16/10/13","Mabiel Herrera ","16/10/13"]
[null,null,"01-28913-03-01",10,"Recibidor de Mariscos Don Chino","16/10/13","082027-01",0,"PC-012-01","Francisco Jiron Arias","H-0088-98PTS-2064-12","La Nira III","11309 PP","Cuerda","6 H",2,"Las Corteza, Golfo de Nicoya","Corvina pequena",null,"P.P.",3.6,"Corvina reina",null,"P.G.",10.4,null,null,null,null,null,null,null,null,null,null,null,null,"Fresco",3,2,"Fresco",2,2,"Mabiel Herrera","16/10/13","Mabiel Herrera ","16/10/13"]
[null,null,"01-29013-06-01",11,"Recibidor de Mariscos Don Chino","17/10/13","082027-01",0,"PC-012-01","Luis D. Herrera","H-0014-03-PTS-1997-12","Don Chino","11107 PP","Cuerda","5 H",2,"San Lucas, Golfo de Nicoya","Corvina reina",null,"P.G.",26.2,null,null,null,null,null,null,null,null,null,null,null,null,null,null,null,null,"Fresco",2,3,"Fresco",2,2,"Mabiel Herrera","17/10/13","Mabiel Herrera ","17/10/13"]
[null,null,"01-29013-05-01",12,"Recibidor de Mariscos Don Chino","17/10/13","082027-01",0,"PC-012-01","Ana C. Villareal Brenes","H-0515-08PTS-227-12","Olamar Yes","P012137","Cuerda","4 H",2,"Las Corteza, Golfo de Nicoya","Corvina reina",null,"P.G.",4.9000000000000004,"Corvina pequena",null,"P.P.",9.4,null,null,null,null,null,null,null,null,null,null,null,null,"Fresco",3,2,"Fresco",2,2,"Mabiel Herrera","17/10/13","Mabiel Herrera ","17/10/13"]
[null,null,"01-29113-06-01",13,"Recibidor de Mariscos Don Chino","18/10/13","082027-01",0,"PC-012-01","Luis D. Herrera","H-0014-03-PTS-1997-12","Don Chino","11107 PP","Cuerda","5 H",2,"San Lucas, Golfo de Nicoya","Corvina reina",null,"P.G.",29.1,"Corvina pequena",null,"P.P.",75.400000000000006,null,null,null,null,null,null,null,null,null,null,null,null,"Fresco",2,2,"Fresco",2,2,"Mabiel Herrera","18/10/13","Mabiel Herrera ","18/10/13"]
[null,null,"01-29113-05-01",14,"Recibidor de Mariscos Don Chino","18/10/13","082027-01",0,"PC-012-01","Ana C. Villareal Brenes","H-0515-08PTS-227-12","Olamar Yes","P012137","Cuerda","5 H",2,"Las Corteza, Golfo de Nicoya","Corvina reina",null,"P.G.",24.1,null,null,null,null,null,null,null,null,null,null,null,null,null,null,null,null,"Fresco",2,2,"Fresco",2,2,"Mabiel Herrera","2013-10-18","Mabiel Herrera","2013-10-18"]
[null,null,"01-29113-03-01",16,"Recibidor de Mariscos Don Chino","18/10/13","082027-01",0,"PC-012-01","Francisco Jiron Arias","H-0088-98PTS-2064-12","La Nira III","11309 PP","Cuerda","5 H",2,"Las Corteza, Golfo de Nicoya","Corvina pequena",null,"P.P.",12,null,null,null,null,null,null,null,null,null,null,null,null,null,null,null,null,"Fresco",2,2,"Fresco",2,2,"Mabiel Herrera","18/10/13","Mabiel Herrera ","18/10/13"]
[null,null,"01-29513-06-01",18,"Recibidor de Mariscos Don Chino","19/10/13","082027-01",0,"PC-012-01","Luis D. Herrera","H-0014-03-PTS-1997-12","Don chino","11107 PP","Cuerda","1 D",2,"San Lucas, Golfo de Nicoya","Corvina reina",null,"P.G.",23.4,"Corvina pequena",null,"P.P.",9,null,null,null,null,null,null,null,null,null,null,null,null,"Fresco",2,3,"Fresco",2,2,"Mabiel Herrera","19/10/13","Mabiel Herrera ","19/10/13"]
[null,null,"01-29813-12-10",25,"Recibidor de Mariscos Don Chino","25/10/13","082027-01",0,"PC-012-01","Gerardo Peña","H-0089-93-PTS-2118-12","Jose Miguel","9410 PP","Cuerda","5 H",2,"Pescadero, Golfo de Nicoya","Corvina pequena",null,"P.P.",34.9,null,null,null,null,null,null,null,null,null,null,null,null,null,null,null,null,"Fresco",2,3,"Fresco",2,2,"Mabiel Herrera","27/10/13","Mabiel Herrera ","27/10/13"]
[null,null,"01-29813-13-01",26,"Recibidor de Mariscos Don Chino","25/10/13","082027-01",0,"PC-012-01","Mabiel Herrera Ramirez","H-004-09PTS-1241-10","Saharin III","11911 PP","Cuerda","5 H",2,"Respaldo, Golfo de Nicoya","Corvina reina",null,"P.G.",23.8,"Corvina pequena",null,"P.P.",11.1,null,null,null,null,null,null,null,null,null,null,null,null,"Fresco",2,2,"Fresco",2,2,"Mabiel Herrera","27/10/13","Mabiel Herrera ","27/10/13"]
[null,null,"01-29913-09-01",27,"Recibidor de Mariscos Don Chino","26/10/13","082027-01",0,"PC-012-01","Juan Jose Perez","H-0039-97PTS-1325-11","Katy IV","10018 PP","Cuerda","7 H",3,"Pescadero, Golfo de Nicoya","Corvina reina",null,"P.G.",9.9,"Corvina pequena",null,"P.P.",59.1,null,null,null,null,null,null,null,null,null,null,null,null,"Fresco",3,2,"Fresco",2,2,"Mabiel Herrera","27/10/13","Mabiel Herrera ","27/10/13"]
[null,null,"01-29913-03-01",28,"Recibidor de Mariscos Don Chino","26/10/13","082027-01",0,"PC-012-01","Francisco Jiron Arias","H-0088-98PTS-2064-12","La Nira III","11309 PP","Cuerda","5 H",2,"Pescadero, Golfo de Nicoya","Corvina reina",null,"P.G.",6,"Corvina pequena",null,"P.P.",30,null,null,null,null,null,null,null,null,null,null,null,null,"Fresco",2,2,"Fresco",2,2,"Mabiel Herrera","27/10/13","Mabiel Herrera ","27/10/13"]
[null,null,"01-29913-06-01",29,"Recibidor de Mariscos Don Chino","26/10/13","082027-01",0,"PC-012-01","Luis D. Herrera","H-0014-03-PTS-1997-12","Don Chino","11107 PP","Cuerda","7 H",2,"San Lucas, Golfo de Nicoya","Corvina pequena",null,"P.P.",8.6,"Pargo",null,"Pargo, Amarillo",10.9,"Corvina reina",null,"P.G. ",63.3,null,null,null,null,null,null,null,null,"Fresco",2,2,"Fresco",2,2,"Mabiel Herrera","27/10/13","Mabiel Herrera ","27/10/13"]
[null,null,"01-29913-10-01",30,"Recibidor de Mariscos Don Chino","26/10/13","082027-01",0,"PC-012-01","Maximilliano Peña","H-0079-79PTS-2061-12","La Pulga P.","9706 PP","Cuerda","5 H",2,"Pescadero, Golfo de Nicoya","Corvina pequena",null,"P.P.",40.6,null,null,null,null,null,null,null,null,null,null,null,null,null,null,null,null,"Fresco",2,2,"Fresco",2,2,"Mabiel Herrera","27/10/13","Mabiel Herrera ","27/10/13"]
[null,null,"01-30013-12-01",33,"Recibidor de Mariscos Don Chino","27/10/13","082027-01",0,"PC-012-01","Gerardo Peña","H-0089-93-PTS-2118-12","Jose Miguel","9410 PP","Cuerda","5 H",2,"Pescadero, Golfo de Nicoya","Corvina pequena",null,"P.P.",46.6,null,null,null,null,null,null,null,null,null,null,null,null,null,null,null,null,"Fresco",2,2,"Fresco",2,2,"Mabiel Herrera","27/10/13","Martha Ramirez","27/10/13"]
[null,null,"01-30013-10-01",34,"Recibidor de Mariscos Don Chino","27/10/13","082027-01",0,"PC-012-01","Maximilliano Peña","H-0079-79PTS-2061-12","La Pulga P.","9706 PP","Cuerda","4 H",2,"Pescadero, Golfo de Nicoya","Corvina pequena",null,"P.P.",48,null,null,null,null,null,null,null,null,null,null,null,null,null,null,null,null,"Fresco",2,2,"Fresco",2,2,"Mabiel Herrera","27/10/13","Marta Ramirez","27/10/13"]
[null,null,"01-30013-07-01",35,"Recibidor de Mariscos Don Chino","27/10/13","082027-01",0,"PC-012-01","Alexander Chavarra","H-0809-12-PTS","Rosaly","11120 PP","Cuerda","6 H",2,"Pescadero, Golfo de Nicoya","Corvina pequena",null,"P.P.",55.4,"Corvina reina",null,"P.G.",7.6,"Cola",null,"Clase",14.4,null,null,null,null,null,null,null,null,"Frseco",2,3,"Fresco",2,2,"Mabiel Herrera","27/10/13","Martha Ramirez","27/10/13"]
[null,null,"01-30013-01-01",38,"Recibidor de Mariscos Don Chino","27/10/13","082027-01",0,"PC-012-01","Denis Sanchez Peña","P-0412-10-PTS","Dany S.","10975 PP","Línea","8 H",2,"Bejuro, Golfo de Nicoya","Corvina pequena",null,"P.P.",44.6,"Cola",null,"Clase",9.4,null,null,null,null,null,null,null,null,null,null,null,null,"Fresco",2,2,"Fresco",3,2,"Mabiel Herrera","27/10/13","Martha Ramirez","27/10/13"]
[null,null,"01-30013-02-01",39,"Recibidor de Mariscos Don Chino","27/10/13","082027-01",0,"PC-012-01","Deyler Garcia Guevara","H-0802-12-PTS","Yuma D.","P-012106","Línea","7 H",2,"Caballo, Golfo de Nicoya","Corvina pequena",null,"P.P.",59.1,"Corvina reina",null,"P.G.",10.8,null,null,null,null,null,null,null,null,null,null,null,null,"Fresco",2,2,"Fresco",3,2,"Mabiel Herrera","27/10/13","Martha Ramirez","27/10/13"]
[null,null,"01-30013-04-01",40,"Recibidor de Mariscos Don Chino","27/10/13","082027-01",0,"PC-012-01","Alexis Perez Fonesca","H-0042-97-10PTS-2169-12","Atayuvi","10393PP","Línea","8 H",2,"Bejuro, Golfo de Nicoya","Corvina reina",null,"P.G.",15.8,"Corvina pequena",null,"P.P.",80.900000000000006,null,null,null,null,null,null,null,null,null,null,null,null,"Fresco",2,3,"Fresco",2,2,"Mabiel Herrera","27/10/13","Martha Ramirez","27/10/13"]
[null,null,"01-30013-05-01",41,"Recibidor de Mariscos Don Chino","27/10/13","082027-01",0,"PC-012-01","Ana C. Villareal Brenes","H-0515-08PTS-227-12","Olamar Yes","P012137","Línea","9 H",2,"Chira, Golfo de Nicoya","Corvina reina",null,"P.G.",19.5,"Corvina pequena",null,"P.P.",68.099999999999994,null,null,null,null,null,null,null,null,null,null,null,null,"Fresco",2,3,"Fresco",2,2,"Mabiel Herrera","27/10/13","Martha Ramirez","27/10/13"]
{"$rows_left_out":511}
{"sheet":"LookupLists","index":3,"n_rows":163,"n_cols":15,"rows_kept":163,"cut":false,"hidden":false,"merged":[]}
["Centro de Acopio","#CVO","#SIREA","#INCOPESCA","Nombre (Pescador)","Licencia de Pesca","Nombre de la Embarcacion","# de Matrícula","Arte de Pesca","Área de Pesca","Nombre Común","Nombre Científico","Clasificación ","Nombre Responsable","Verificador"]
["Recibidor de Mariscos Don Chino","082027-01",null,"PC-012-01","Alexander Chavarra","H-0809-12-PTS","Rosaly","11120 PP","Cuerda","Bejuro, Golfo de Nicoya","Aguja","Tylosurus crocodilus fodiator",null,"Laura Murillo C.","Marta Ramirez"]
["Cama-Pez de la Costa","060878-01",null,"SC-PC-024-13","Alexis Perez Fonesca","H-0042-97-10PTS-2169-12","Atayuvi","10393PP","Línea","Caballo, Golfo de Nicoya","Albacora, atún blanco","Thunnus alalunga",null,"Mabiel Herrera","Luis Herrera"]
[null,null,null,null,"Ana C. Villareal Brenes","H-0515-08PTS-227-12","Olamar Yes","P012137",null,"Canalon, Costa de Pajaros, Gulfo de Nicoya","Anchoa agallona","Centengraulis mysticetus",null,"Maura Munillo ","Mabiel Herrera"]
[null,null,null,null,"Barrantes Perez Wilfreth","P-0397-10-PTS","Dancing Waves",11793,null,"Chira, Golfo de Nicoya","Atún aleta amarilla","Thunnus albacares",null,"Monica Villalobos","Manrique Alvarez Mediano"]
[null,null,null,null,"Baudilio Barrantes Jiminez","H-0028-94PTS-2048-12","Talolinga","6554 PP",null,"Las Corteza, Golfo de Nicoya","Atún negro","Euthynnus lineatus",null,"Nela"]
[null,null,null,null,"Coto",null,"Patricia",null,null,"Pescadero, Gulfo de Nicoya","Atún patudo, atún ojón","Thunnus obesus",null,"Marta Ramirez"]
[null,null,null,null,"Denis Sanchez Peña","P-0412-10-PTS","Dany S.","10975 PP",null,"Respaldo, Golfo de Nicoya","Bagre","Cathorops steindachneri "]
[null,null,null,null,"Deyler Garcia Guevara","H-0802-12-PTS","Yuma D.","P-012106",null,"San Lucas, Golfo de Nicoya","Bagre cuminate","Occidentarius platypogon"]
[null,null,null,null,"Diego Hererra Ramirez","H-001403PTS-1997-12","Don Chino","11107 PP",null,"Golfo de Nicoya","Bagre, cuminate","Bagre panamensis"]
[null,null,null,null,"Emilia Rojas Mendoza","P-0347-10PTS","Fernando","11742 PP",null,"Sirial Chomes","Barracuda","Sphyraena ensis"]
[null,null,null,null,"Francisco Jiron Arias","H-0088-98PTS-2064-12","La Nira III","11309 PP",null,null,"Barrilete listado","Katsuwonus pelamis"]
[null,null,null,null,"Gerardo Peña","H-0089-93-PTS-2118-12","Jose Miguel","9410 PP",null,null,"Berrugate","Lobotes pacificus"]
[null,null,null,null,"Ivan Barahona","P-0412-10-Pts","Lucero",null,null,null,"Berrugate","Lobotes surinamensis"]
[null,null,null,null,"Jose Emilio Herrera Rojas","P-0718-11-PTS","Navil H.R.","11772 PP",null,null,"Bonito mono","Sarda orientalis"]
[null,null,null,null,"Jose Jiron Arias","P-0347-10-PTS","Fernando","11742 PP",null,null,"Bonito ojón","Chloroscombrus orqueta"]
[null,null,null,null,"Juan Jose Perez","H-0039-97PTS-1325-11","Katy IV","10018 PP",null,null,"Cabrilla doncella","Hemanthias signifer "]
[null,null,null,null,"Luis D. Herrera","H-0014-03-PTS-1997-12","Don Chino","11107 PP",null,null,"Cabrilla gris","Hporthodus niphobles"]
[null,null,null,null,"Mabiel Herrera Ramirez","H-004-09PTS-1241-10","Saharin III","11911 PP",null,null,"Cabrilla pintada","Epinephelus analogus"]
[null,null,null,null,"Manrique A. Alvarez Medrano","H-0048-97-PTS-2449-12","CHATO M","P 012141",null,null,"Cabrilla pintada","Epinephelus labriformis"]
[null,null,null,null,"Marcos Guevara ","---","Esteben","---",null,null,"Chopa común","Kyphosus elegans"]
[null,null,null,null,"Mario Pena",null,"La Pulpa",null,null,null,"Chopa rayada","Kyphosus analogus"]
[null,null,null,null,"Marlyn Campos","---","Cristina","---",null,null,"Chopa salema","Sectator ocyurus"]
[null,null,null,null,"Maximilliano Peña","H-0079-79PTS-2061-12","La Pulga P.","9706 PP",null,null,"Conejo","Caulolatilus affinis"]
[null,null,null,null,"Monica Villalobos","H-0049-03-PTS-2450-12","Alonso M.","P-012093",null,null,"Congrio pintado","Brotula ordwayi"]
[null,null,null,null,"Rodolfo Martin Ulloa","H-0135-93-PTS-2127-12","San Jose V","10750 PP",null,null,"Congrio pintado, Anguila","Cynoponticus coniceps"]
[null,null,null,null,"Timoteo Alvarez Rojas","H-0040-97-PTS-2442-12","Berrea P","P 012097",null,null,"Congrio rosado","Brotula clarkae"]
[null,null,null,null,"Ulfreth Barrantes",null,"Dancing Waves",null,null,null,"Cornuda","Sphyrna media"]
[null,null,null,null,null,null,null,null,null,null,"Corvina agria","Micropogonias altipinnis"]
[null,null,null,null,null,null,null,null,null,null,"Corvina aguada","Cynoscion squamipinnis"]
{"$rows_left_out":134}
{"sheet":"MyLinks","index":4,"n_rows":18,"n_cols":2,"rows_kept":18,"cut":false,"hidden":false,"merged":[]}
[]
[null,"Contextures Links"]
[]
[null,"PivotPower Premium Add-in"]
[null,"UserForms for Data Entry ebook Kit"]
[null,"30 Excel Functions in 30 Days eBook Kit"]
[null,"Contextures Excel Tips Website"]
[null,"Contextures Excel Blog"]
[null,"Excel Pivot Tables Blog"]
[null,"Debra's Pivot Table Books on Amazon"]
[]
[null,"Contextures Recommends"]
[]
[null,"Jon Peltier's Excel Chart Utilities"]
[null,"ExcelUser Dashboards"]
[null,"Excel Courses Online"]
[null,"Chandoo's Excel VBA School"]
[null,"Chandoo's Project Management Templates"]