{"text_format":"1","workbook":"xlsx","n_sheets":10,"sheets":["Introduction","Instructions","1 - Cost Estimations","2 - Flood Scenario","3 - People per Household","4 - Inputs","5 - Outputs","6 - Summary","7 - Calculations","8 - Sources"],"not_rendered":{"charts":0,"images":0,"macros":1,"external_links":0,"defined_names":0,"comments":2,"pivot_tables":0},"unopened":[],"bounds":{"document_bytes":16777216,"sheet_cells":100000,"rows_first":2000,"rows_last":500,"rows_between":2000,"halvings":0,"cell_chars":16384,"cell_head_chars":4096},"cells_cut":0,"cells_raw":0,"read":"whole","date_system":"1900"}

{"sheet":"Introduction","index":0,"n_rows":34,"n_cols":3,"rows_kept":34,"cut":false,"hidden":false,"merged":[[1,1,1,4]]}
[]
[null,"Modelling the Direct Impacts of Flooding in London"]
[]
[null,"Overview"]
[]
[null,"- The purpose of this spreadsheet is to estimate the direct impacts of flooding in a hypothetical flood scenario in London."]
[]
[null,null,"- It is designed to be easy to use, with inputs obtained from readily available sources."]
{"$rows_left_out":27}
{"sheet":"Instructions","index":1,"n_rows":30,"n_cols":4,"rows_kept":30,"cut":false,"hidden":false,"merged":[[1,1,1,3],[2,1,2,3],[3,1,3,3],[4,1,4,3],[7,1,7,3],[8,1,8,3],[9,1,9,3],[14,1,14,2],[12,1,12,3],[5,1,5,3],[6,1,6,3]]}
[]
[null,"General Notes"]
[]
[null,"- Yellow cells are input cells.  Other cells contain formulas and references and cannot be edited."]
[]
[null,"- Green cells indicate a value used in calculations that is specific to the borough being analyzed."]
[]
[null,"- Inputs that are not taken from GIS maps (used to calculate values in green cells) are taken from the source referenced below them.  The links to these sources can be found in the Sources tab."]
{"$rows_left_out":23}
{"sheet":"1 - Cost Estimations","index":2,"n_rows":36,"n_cols":19,"rows_kept":36,"cut":false,"hidden":false,"merged":[[32,2,36,2],[29,1,31,1],[32,1,36,1],[25,1,28,1],[31,9,31,13],[3,2,11,2],[3,1,11,1],[12,1,15,1],[29,2,31,2],[20,2,24,2],[25,2,28,2],[12,2,19,2],[1,15,1,18],[29,15,29,18],[1,9,1,13],[9,9,9,13],[6,9,6,13],[11,9,11,10],[11,12,11,13],[16,1,19,1]]}
[]
[null,"Source","Category","Cost Estimation Factors","Value","Unit",null,"List of Affected Areas",null,"Cost of School Day",null,null,null,null,null,"Future Projections"]
[]
[null,"EA 2007 Flood Report","Utility",null,null,null,null,null,null,"Input Funding per Pupil (age 3-19) for the affected area:",null,null,null,null,null,"Affected Areas","Current Total Population","Projected Future Total Population","Percent Change in Population"]
[null,null,null,"Electricity deprivation cost",10,"£/household/kWh"]
[null,null,null,"Average Household Electricity Consumption",0.37669999999999998,"kWh/hour",null,null,null,"Cost of School Day ",null,null,null,{"$f":"N4/190","v":0},null,{"$f":"H4","v":0},0,0,{"$f":"IF(OR(P6=0,Q6=0,R6=0),0,((R6-Q6)/Q6))","v":0}]
[null,null,null,"Average electricity deprivation time",14.6,"hours",null,null,null,"Department for Education",null,null,null,null,null,0,0,0,{"$f":"IF(OR(P7=0,Q7=0,R7=0),0,((R7-Q7)/Q7))","v":0}]
[null,null,null,"Water failure cost",10,"£/household/day",null,null,null,null,null,null,null,null,null,0,0,0,0]
{"$rows_left_out":29}
{"sheet":"2 - Flood Scenario","index":3,"n_rows":0,"n_cols":0,"rows_kept":0,"cut":false,"hidden":false,"merged":[]}

{"sheet":"3 - People per Household","index":4,"n_rows":30,"n_cols":13,"rows_kept":30,"cut":false,"hidden":false,"merged":[[2,2,2,12],[29,2,29,12]]}
[]
[]
[null,null,"Average Number of People Living in Households"]
[]
[null,null,null,"Total",1,2,3,4,5,6,7,8,"Average"]
[null,null,{"$f":"'1 - Cost Estimations'!H4","v":0},{"$f":"IF(C6=0,0,SUM(E6:L6))","v":0},0,0,0,0,0,0,0,0,{"$f":"IF(D6=0,0,((F6*$F$5)+(G6*$G$5)+(H6*$H$5)+(I6*$I$5)+(J6*$J$5)+(K6*$K$5)+(L6*$L$5)+(E6*$E$5))/D6)","v":0}]
[null,null,{"$f":"'1 - Cost Estimations'!H5","v":0},{"$f":"IF(C7=0,0,SUM(E7:L7))","v":0},0,0,0,0,0,0,0,0,{"$f":"IF(D7=0,0,((F7*$F$5)+(G7*$G$5)+(H7*$H$5)+(I7*$I$5)+(J7*$J$5)+(K7*$K$5)+(L7*$L$5)+(E7*$E$5))/D7)","v":0}]
[null,null,{"$f":"'1 - Cost Estimations'!H6","v":0},0,0,0,0,0,0,0,0,0,0]
{"$rows_left_out":23}
{"sheet":"4 - Inputs","index":5,"n_rows":28,"n_cols":7,"rows_kept":28,"cut":false,"hidden":false,"merged":[[1,2,1,6]]}
[]
[null,null,"Inputs Taken from GIS Maps"]
[]
[null,null,"Number of Households in Flood Zone","Number of Businesses in Flood Zone","Number of Schools in Flood Zone","Number of School Pupils in Schools in Flood Zone","Number of GPs in Flood Zone"]
[null,{"$f":"'3 - People per Household'!C6","v":0},0,0,0,0,0]
[null,{"$f":"'3 - People per Household'!C7","v":0},0,0,0,0,0]
[null,{"$f":"'3 - People per Household'!C8","v":0},0,0,0,0,0]
[null,{"$f":"'3 - People per Household'!C9","v":0},0,0,0,0,0]
{"$rows_left_out":21}
{"sheet":"5 - Outputs","index":6,"n_rows":29,"n_cols":30,"rows_kept":29,"cut":false,"hidden":false,"merged":[[0,5,0,7],[0,1,0,3],[0,25,0,27],[0,21,0,23],[0,9,0,13],[0,15,0,19]]}
[null,"People",null,null,null,"Health",null,null,null,"Domestic",null,null,null,null,null,"Businesses",null,null,null,null,null,"Schools",null,null,null,"Utilities",null,null,null,"Waste"]
[]
["Affected Areas","Number of People Affected","Number of People Temporarily Relocated","Number of People Requiring Evacuation Assistance",null,"Number of People Reporting Health Concerns","Number of People Requiring a GP Visit","Number of GPs Affected",null,"Number of Households Affected","Total Cost of Damages to Households","Total Uninsured Damage","Number of Households Requiring Temporary Accomodation","Total Cost of Temporary Accomodation for Households",null,"Number of Businesses Affected","Total Cost of Damages to Businesses","Total Uninsured Damage","Number of Businesses Requiring Temporary Accomodation","Total Cost of Temporary Accomodation for Businesses",null,"Number of Schools Affected","Total Number of Pupil Days Lost","Total \"Cost of School Day\" Impacts",null,"Total Cost of Electricity Deprivation","Total Cost of Water Failure","Total Cost of Sewage Failure",null,"Tonnes of Waste Produced"]
[{"$f":"'4 - Inputs'!B5","v":0},{"$f":"IF(A4=0,0,'3 - People per Household'!M6*J4)","v":0},{"$f":"IF(A4=0,0,'5 - Outputs'!M4*'3 - People per Household'!M6)","v":0},{"$f":"IF(A4=0,0,B4*'1 - Cost Estimations'!$E$24)","v":0},null,{"$f":"IF(A4=0,0,B4*0.415)","v":0},{"$f":"IF(A4=0,0,F4*0.39)","v":0},{"$f":"IF(A4=0,0,'4 - Inputs'!G5)","v":0},null,{"$f":"IF(A4=0,0,'4 - Inputs'!C5)","v":0},{"$f":"IF(A4=0,0,J4*'1 - Cost Estimations'!$E$14)","v":0},{"$f":"IF(A4=0,0,0.24*K4)","v":0},{"$f":"IF(A4=0,0,0.3*J4)","v":0},{"$f":"IF(A4=0,0,M4*'1 - Cost Estimations'!$E$35)","v":0},null,{"$f":"IF(A4=0,0,'4 - Inputs'!D5)","v":0},{"$f":"IF(A4=0,0,P4*'1 - Cost Estimations'!$E$18)","v":0},{"$f":"IF(A4=0,0,0.05*Q4)","v":0},{"$f":"IF(A4=0,0,0.3*P4)","v":0},{"$f":"IF(A4=0,0,S4*'1 - Cost Estimations'!$E$36)","v":0},null,{"$f":"IF(A4=0,0,'4 - Inputs'!E5)","v":0},{"$f":"IF(A4=0,0,'4 - Inputs'!F5*'1 - Cost Estimations'!$E$28)","v":0},{"$f":"IF(A4=0,0,W4*'1 - Cost Estimations'!$E$27)","v":0},null,{"$f":"IF(A4=0,0,'1 - Cost Estimations'!$E$7*('4 - Inputs'!C5+'4 - Inputs'!D5)*'1 - Cost Estimations'!$E$5*'1 - Cost Estimations'!$E$6)","v":0},{"$f":"IF(A4=0,0,('4 - Inputs'!C5+'4 - Inputs'!D5)*'1 - Cost Estimations'!$E$9*'1 - Cost Estimations'!$E$8)","v":0},{"$f":"IF(A4=0,0,('4 - Inputs'!C5+'4 - Inputs'!D5)*'1 - Cost Estimations'!$E$11*'1 - Cost Estimations'!$E$10)","v":0},null,{"$f":"IF(A4=0,0,'1 - Cost Estimations'!$E$31*('5 - Outputs'!J4+'5 - Outputs'!P4))","v":0}]
[{"$f":"'4 - Inputs'!B6","v":0},{"$f":"IF(A5=0,0,'3 - People per Household'!M7*J5)","v":0},{"$f":"IF(A5=0,0,'5 - Outputs'!M5*'3 - People per Household'!M7)","v":0},{"$f":"IF(A5=0,0,B5*'1 - Cost Estimations'!$E$24)","v":0},null,{"$f":"IF(A5=0,0,B5*0.415)","v":0},{"$f":"IF(A5=0,0,F5*0.39)","v":0},{"$f":"IF(A5=0,0,'4 - Inputs'!G6)","v":0},null,{"$f":"IF(A5=0,0,'4 - Inputs'!C6)","v":0},{"$f":"IF(A5=0,0,J5*'1 - Cost Estimations'!$E$14)","v":0},{"$f":"IF(A5=0,0,0.24*K5)","v":0},{"$f":"IF(A5=0,0,0.3*J5)","v":0},{"$f":"IF(A5=0,0,M5*'1 - Cost Estimations'!$E$35)","v":0},null,{"$f":"IF(A5=0,0,'4 - Inputs'!D6)","v":0},{"$f":"IF(A5=0,0,P5*'1 - Cost Estimations'!$E$18)","v":0},{"$f":"IF(A5=0,0,0.05*Q5)","v":0},{"$f":"IF(A5=0,0,0.3*P5)","v":0},{"$f":"IF(A5=0,0,S5*'1 - Cost Estimations'!$E$36)","v":0},null,{"$f":"IF(A5=0,0,'4 - Inputs'!E6)","v":0},{"$f":"IF(A5=0,0,'4 - Inputs'!F6*'1 - Cost Estimations'!$E$28)","v":0},{"$f":"IF(A5=0,0,W5*'1 - Cost Estimations'!$E$27)","v":0},null,{"$f":"IF(A5=0,0,'1 - Cost Estimations'!$E$7*('4 - Inputs'!C6+'4 - Inputs'!D6)*'1 - Cost Estimations'!$E$5*'1 - Cost Estimations'!$E$6)","v":0},{"$f":"IF(A5=0,0,('4 - Inputs'!C6+'4 - Inputs'!D6)*'1 - Cost Estimations'!$E$9*'1 - Cost Estimations'!$E$8)","v":0},{"$f":"IF(A5=0,0,('4 - Inputs'!C6+'4 - Inputs'!D6)*'1 - Cost Estimations'!$E$11*'1 - Cost Estimations'!$E$10)","v":0},null,{"$f":"IF(A5=0,0,'1 - Cost Estimations'!$E$31*('5 - Outputs'!J5+'5 - Outputs'!P5))","v":0}]
[{"$f":"'4 - Inputs'!B7","v":0},{"$f":"IF(A6=0,0,'3 - People per Household'!M8*J6)","v":0},{"$f":"IF(A6=0,0,'5 - Outputs'!M6*'3 - People per Household'!M8)","v":0},{"$f":"IF(A6=0,0,B6*'1 - Cost Estimations'!$E$24)","v":0},null,0,0,{"$f":"IF(A6=0,0,'4 - Inputs'!G7)","v":0},null,{"$f":"IF(A6=0,0,'4 - Inputs'!C7)","v":0},{"$f":"IF(A6=0,0,J6*'1 - Cost Estimations'!$E$14)","v":0},0,0,{"$f":"IF(A6=0,0,M6*'1 - Cost Estimations'!$E$35)","v":0},null,{"$f":"IF(A6=0,0,'4 - Inputs'!D7)","v":0},{"$f":"IF(A6=0,0,P6*'1 - Cost Estimations'!$E$18)","v":0},0,0,{"$f":"IF(A6=0,0,S6*'1 - Cost Estimations'!$E$36)","v":0},null,{"$f":"IF(A6=0,0,'4 - Inputs'!E7)","v":0},{"$f":"IF(A6=0,0,'4 - Inputs'!F7*'1 - Cost Estimations'!$E$28)","v":0},{"$f":"IF(A6=0,0,W6*'1 - Cost Estimations'!$E$27)","v":0},null,{"$f":"IF(A6=0,0,'1 - Cost Estimations'!$E$7*('4 - Inputs'!C7+'4 - Inputs'!D7)*'1 - Cost Estimations'!$E$5*'1 - Cost Estimations'!$E$6)","v":0},{"$f":"IF(A6=0,0,('4 - Inputs'!C7+'4 - Inputs'!D7)*'1 - Cost Estimations'!$E$9*'1 - Cost Estimations'!$E$8)","v":0},{"$f":"IF(A6=0,0,('4 - Inputs'!C7+'4 - Inputs'!D7)*'1 - Cost Estimations'!$E$11*'1 - Cost Estimations'!$E$10)","v":0},null,{"$f":"IF(A6=0,0,'1 - Cost Estimations'!$E$31*('5 - Outputs'!J6+'5 - Outputs'!P6))","v":0}]
[{"$f":"'4 - Inputs'!B8","v":0},{"$f":"IF(A7=0,0,'3 - People per Household'!M9*J7)","v":0},{"$f":"IF(A7=0,0,'5 - Outputs'!M7*'3 - People per Household'!M9)","v":0},{"$f":"IF(A7=0,0,B7*'1 - Cost Estimations'!$E$24)","v":0},null,0,0,{"$f":"IF(A7=0,0,'4 - Inputs'!G8)","v":0},null,{"$f":"IF(A7=0,0,'4 - Inputs'!C8)","v":0},{"$f":"IF(A7=0,0,J7*'1 - Cost Estimations'!$E$14)","v":0},0,0,{"$f":"IF(A7=0,0,M7*'1 - Cost Estimations'!$E$35)","v":0},null,{"$f":"IF(A7=0,0,'4 - Inputs'!D8)","v":0},{"$f":"IF(A7=0,0,P7*'1 - Cost Estimations'!$E$18)","v":0},0,0,{"$f":"IF(A7=0,0,S7*'1 - Cost Estimations'!$E$36)","v":0},null,{"$f":"IF(A7=0,0,'4 - Inputs'!E8)","v":0},{"$f":"IF(A7=0,0,'4 - Inputs'!F8*'1 - Cost Estimations'!$E$28)","v":0},{"$f":"IF(A7=0,0,W7*'1 - Cost Estimations'!$E$27)","v":0},null,{"$f":"IF(A7=0,0,'1 - Cost Estimations'!$E$7*('4 - Inputs'!C8+'4 - Inputs'!D8)*'1 - Cost Estimations'!$E$5*'1 - Cost Estimations'!$E$6)","v":0},{"$f":"IF(A7=0,0,('4 - Inputs'!C8+'4 - Inputs'!D8)*'1 - Cost Estimations'!$E$9*'1 - Cost Estimations'!$E$8)","v":0},{"$f":"IF(A7=0,0,('4 - Inputs'!C8+'4 - Inputs'!D8)*'1 - Cost Estimations'!$E$11*'1 - Cost Estimations'!$E$10)","v":0},null,{"$f":"IF(A7=0,0,'1 - Cost Estimations'!$E$31*('5 - Outputs'!J7+'5 - Outputs'!P7))","v":0}]
[{"$f":"'4 - Inputs'!B9","v":0},{"$f":"IF(A8=0,0,'3 - People per Household'!M10*J8)","v":0},{"$f":"IF(A8=0,0,'5 - Outputs'!M8*'3 - People per Household'!M10)","v":0},{"$f":"IF(A8=0,0,B8*'1 - Cost Estimations'!$E$24)","v":0},null,0,0,{"$f":"IF(A8=0,0,'4 - Inputs'!G9)","v":0},null,{"$f":"IF(A8=0,0,'4 - Inputs'!C9)","v":0},{"$f":"IF(A8=0,0,J8*'1 - Cost Estimations'!$E$14)","v":0},0,0,{"$f":"IF(A8=0,0,M8*'1 - Cost Estimations'!$E$35)","v":0},null,{"$f":"IF(A8=0,0,'4 - Inputs'!D9)","v":0},{"$f":"IF(A8=0,0,P8*'1 - Cost Estimations'!$E$18)","v":0},0,0,{"$f":"IF(A8=0,0,S8*'1 - Cost Estimations'!$E$36)","v":0},null,{"$f":"IF(A8=0,0,'4 - Inputs'!E9)","v":0},{"$f":"IF(A8=0,0,'4 - Inputs'!F9*'1 - Cost Estimations'!$E$28)","v":0},{"$f":"IF(A8=0,0,W8*'1 - Cost Estimations'!$E$27)","v":0},null,{"$f":"IF(A8=0,0,'1 - Cost Estimations'!$E$7*('4 - Inputs'!C9+'4 - Inputs'!D9)*'1 - Cost Estimations'!$E$5*'1 - Cost Estimations'!$E$6)","v":0},{"$f":"IF(A8=0,0,('4 - Inputs'!C9+'4 - Inputs'!D9)*'1 - Cost Estimations'!$E$9*'1 - Cost Estimations'!$E$8)","v":0},{"$f":"IF(A8=0,0,('4 - Inputs'!C9+'4 - Inputs'!D9)*'1 - Cost Estimations'!$E$11*'1 - Cost Estimations'!$E$10)","v":0},null,{"$f":"IF(A8=0,0,'1 - Cost Estimations'!$E$31*('5 - Outputs'!J8+'5 - Outputs'!P8))","v":0}]
{"$rows_left_out":22}
{"sheet":"6 - Summary","index":7,"n_rows":27,"n_cols":16,"rows_kept":27,"cut":false,"hidden":false,"merged":[]}
[null,"Number of Households Affected","Number of Businesses Affected","Number of Schools Affected","Number of People Affected","Number of GPs Affected","Number of People with Health Concerns","Number of People Requiring GP Visit","Number of People Temporarily Relocated","Number of People Requiring Evacuation Assistance","Tonnes of Waste Produced","Total Uninsured Cost ",null,"Total Cost ",null,"Total Cost       (20 Year Projection)"]
[{"$f":"'5 - Outputs'!A4","v":0},{"$f":"IF(A2=0,0,'5 - Outputs'!J4)","v":0},{"$f":"IF(A2=0,0,'5 - Outputs'!P4)","v":0},{"$f":"IF(A2=0,0,'5 - Outputs'!V4)","v":0},{"$f":"IF(A2=0,0,'5 - Outputs'!B4)","v":0},{"$f":"IF(A2=0,0,'5 - Outputs'!H4)","v":0},{"$f":"IF(A2=0,0,'5 - Outputs'!F4)","v":0},{"$f":"IF(A2=0,0,'5 - Outputs'!G4)","v":0},{"$f":"IF(A2=0,0,'5 - Outputs'!C4)","v":0},{"$f":"IF(A2=0,0,'5 - Outputs'!D4)","v":0},{"$f":"IF(A2=0,0,'5 - Outputs'!AD4)","v":0},{"$f":"IF(A2=0,0,'5 - Outputs'!L4+'5 - Outputs'!R4)","v":0},null,{"$f":"IF(A2=0,0,'5 - Outputs'!K4+'5 - Outputs'!N4+'5 - Outputs'!Q4+'5 - Outputs'!T4+'5 - Outputs'!X4+'5 - Outputs'!Z4+'5 - Outputs'!AA4+'5 - Outputs'!AB4)","v":0},null,{"$f":"IF(A2=0,0,(('5 - Outputs'!K4+('5 - Outputs'!K4*'1 - Cost Estimations'!S6))+'5 - Outputs'!N4+'5 - Outputs'!Q4+'5 - Outputs'!T4+'5 - Outputs'!X4+'5 - Outputs'!Z4+'5 - Outputs'!AA4+'5 - Outputs'!AB4))","v":0}]
[{"$f":"'5 - Outputs'!A5","v":0},{"$f":"IF(A3=0,0,'5 - Outputs'!J5)","v":0},{"$f":"IF(A3=0,0,'5 - Outputs'!P5)","v":0},{"$f":"IF(A3=0,0,'5 - Outputs'!V5)","v":0},{"$f":"IF(A3=0,0,'5 - Outputs'!B5)","v":0},{"$f":"IF(A3=0,0,'5 - Outputs'!H5)","v":0},{"$f":"IF(A3=0,0,'5 - Outputs'!F5)","v":0},{"$f":"IF(A3=0,0,'5 - Outputs'!G5)","v":0},{"$f":"IF(A3=0,0,'5 - Outputs'!C5)","v":0},{"$f":"IF(A3=0,0,'5 - Outputs'!D5)","v":0},{"$f":"IF(A3=0,0,'5 - Outputs'!AD5)","v":0},{"$f":"IF(A3=0,0,'5 - Outputs'!L5+'5 - Outputs'!R5)","v":0},null,{"$f":"IF(A3=0,0,'5 - Outputs'!K5+'5 - Outputs'!N5+'5 - Outputs'!Q5+'5 - Outputs'!T5+'5 - Outputs'!X5+'5 - Outputs'!Z5+'5 - Outputs'!AA5+'5 - Outputs'!AB5)","v":0},null,{"$f":"IF(A3=0,0,(('5 - Outputs'!K5+('5 - Outputs'!K5*'1 - Cost Estimations'!S7))+'5 - Outputs'!N5+'5 - Outputs'!Q5+'5 - Outputs'!T5+'5 - Outputs'!X5+'5 - Outputs'!Z5+'5 - Outputs'!AA5+'5 - Outputs'!AB5))","v":0}]
[{"$f":"'5 - Outputs'!A6","v":0},{"$f":"IF(A4=0,0,'5 - Outputs'!J6)","v":0},{"$f":"IF(A4=0,0,'5 - Outputs'!P6)","v":0},{"$f":"IF(A4=0,0,'5 - Outputs'!V6)","v":0},{"$f":"IF(A4=0,0,'5 - Outputs'!B6)","v":0},{"$f":"IF(A4=0,0,'5 - Outputs'!H6)","v":0},{"$f":"IF(A4=0,0,'5 - Outputs'!F6)","v":0},{"$f":"IF(A4=0,0,'5 - Outputs'!G6)","v":0},{"$f":"IF(A4=0,0,'5 - Outputs'!C6)","v":0},{"$f":"IF(A4=0,0,'5 - Outputs'!D6)","v":0},{"$f":"IF(A4=0,0,'5 - Outputs'!AD6)","v":0},{"$f":"IF(A4=0,0,'5 - Outputs'!L6+'5 - Outputs'!R6)","v":0},null,{"$f":"IF(A4=0,0,'5 - Outputs'!K6+'5 - Outputs'!N6+'5 - Outputs'!Q6+'5 - Outputs'!T6+'5 - Outputs'!X6+'5 - Outputs'!Z6+'5 - Outputs'!AA6+'5 - Outputs'!AB6)","v":0},null,{"$f":"IF(A4=0,0,(('5 - Outputs'!K6+('5 - Outputs'!K6*'1 - Cost Estimations'!S8))+'5 - Outputs'!N6+'5 - Outputs'!Q6+'5 - Outputs'!T6+'5 - Outputs'!X6+'5 - Outputs'!Z6+'5 - Outputs'!AA6+'5 - Outputs'!AB6))","v":0}]
[{"$f":"'5 - Outputs'!A7","v":0},{"$f":"IF(A5=0,0,'5 - Outputs'!J7)","v":0},{"$f":"IF(A5=0,0,'5 - Outputs'!P7)","v":0},{"$f":"IF(A5=0,0,'5 - Outputs'!V7)","v":0},{"$f":"IF(A5=0,0,'5 - Outputs'!B7)","v":0},{"$f":"IF(A5=0,0,'5 - Outputs'!H7)","v":0},{"$f":"IF(A5=0,0,'5 - Outputs'!F7)","v":0},{"$f":"IF(A5=0,0,'5 - Outputs'!G7)","v":0},{"$f":"IF(A5=0,0,'5 - Outputs'!C7)","v":0},{"$f":"IF(A5=0,0,'5 - Outputs'!D7)","v":0},{"$f":"IF(A5=0,0,'5 - Outputs'!AD7)","v":0},{"$f":"IF(A5=0,0,'5 - Outputs'!L7+'5 - Outputs'!R7)","v":0},null,{"$f":"IF(A5=0,0,'5 - Outputs'!K7+'5 - Outputs'!N7+'5 - Outputs'!Q7+'5 - Outputs'!T7+'5 - Outputs'!X7+'5 - Outputs'!Z7+'5 - Outputs'!AA7+'5 - Outputs'!AB7)","v":0},null,{"$f":"IF(A5=0,0,(('5 - Outputs'!K7+('5 - Outputs'!K7*'1 - Cost Estimations'!S9))+'5 - Outputs'!N7+'5 - Outputs'!Q7+'5 - Outputs'!T7+'5 - Outputs'!X7+'5 - Outputs'!Z7+'5 - Outputs'!AA7+'5 - Outputs'!AB7))","v":0}]
[{"$f":"'5 - Outputs'!A8","v":0},{"$f":"IF(A6=0,0,'5 - Outputs'!J8)","v":0},{"$f":"IF(A6=0,0,'5 - Outputs'!P8)","v":0},{"$f":"IF(A6=0,0,'5 - Outputs'!V8)","v":0},{"$f":"IF(A6=0,0,'5 - Outputs'!B8)","v":0},{"$f":"IF(A6=0,0,'5 - Outputs'!H8)","v":0},{"$f":"IF(A6=0,0,'5 - Outputs'!F8)","v":0},{"$f":"IF(A6=0,0,'5 - Outputs'!G8)","v":0},{"$f":"IF(A6=0,0,'5 - Outputs'!C8)","v":0},{"$f":"IF(A6=0,0,'5 - Outputs'!D8)","v":0},{"$f":"IF(A6=0,0,'5 - Outputs'!AD8)","v":0},{"$f":"IF(A6=0,0,'5 - Outputs'!L8+'5 - Outputs'!R8)","v":0},null,{"$f":"IF(A6=0,0,'5 - Outputs'!K8+'5 - Outputs'!N8+'5 - Outputs'!Q8+'5 - Outputs'!T8+'5 - Outputs'!X8+'5 - Outputs'!Z8+'5 - Outputs'!AA8+'5 - Outputs'!AB8)","v":0},null,{"$f":"IF(A6=0,0,(('5 - Outputs'!K8+('5 - Outputs'!K8*'1 - Cost Estimations'!S10))+'5 - Outputs'!N8+'5 - Outputs'!Q8+'5 - Outputs'!T8+'5 - Outputs'!X8+'5 - Outputs'!Z8+'5 - Outputs'!AA8+'5 - Outputs'!AB8))","v":0}]
[{"$f":"'5 - Outputs'!A9","v":0},{"$f":"IF(A7=0,0,'5 - Outputs'!J9)","v":0},{"$f":"IF(A7=0,0,'5 - Outputs'!P9)","v":0},{"$f":"IF(A7=0,0,'5 - Outputs'!V9)","v":0},{"$f":"IF(A7=0,0,'5 - Outputs'!B9)","v":0},{"$f":"IF(A7=0,0,'5 - Outputs'!H9)","v":0},{"$f":"IF(A7=0,0,'5 - Outputs'!F9)","v":0},{"$f":"IF(A7=0,0,'5 - Outputs'!G9)","v":0},{"$f":"IF(A7=0,0,'5 - Outputs'!C9)","v":0},{"$f":"IF(A7=0,0,'5 - Outputs'!D9)","v":0},{"$f":"IF(A7=0,0,'5 - Outputs'!AD9)","v":0},{"$f":"IF(A7=0,0,'5 - Outputs'!L9+'5 - Outputs'!R9)","v":0},null,{"$f":"IF(A7=0,0,'5 - Outputs'!K9+'5 - Outputs'!N9+'5 - Outputs'!Q9+'5 - Outputs'!T9+'5 - Outputs'!X9+'5 - Outputs'!Z9+'5 - Outputs'!AA9+'5 - Outputs'!AB9)","v":0},null,{"$f":"IF(A7=0,0,(('5 - Outputs'!K9+('5 - Outputs'!K9*'1 - Cost Estimations'!S11))+'5 - Outputs'!N9+'5 - Outputs'!Q9+'5 - Outputs'!T9+'5 - Outputs'!X9+'5 - Outputs'!Z9+'5 - Outputs'!AA9+'5 - Outputs'!AB9))","v":0}]
[{"$f":"'5 - Outputs'!A10","v":0},{"$f":"IF(A8=0,0,'5 - Outputs'!J10)","v":0},{"$f":"IF(A8=0,0,'5 - Outputs'!P10)","v":0},{"$f":"IF(A8=0,0,'5 - Outputs'!V10)","v":0},{"$f":"IF(A8=0,0,'5 - Outputs'!B10)","v":0},{"$f":"IF(A8=0,0,'5 - Outputs'!H10)","v":0},{"$f":"IF(A8=0,0,'5 - Outputs'!F10)","v":0},{"$f":"IF(A8=0,0,'5 - Outputs'!G10)","v":0},{"$f":"IF(A8=0,0,'5 - Outputs'!C10)","v":0},{"$f":"IF(A8=0,0,'5 - Outputs'!D10)","v":0},{"$f":"IF(A8=0,0,'5 - Outputs'!AD10)","v":0},{"$f":"IF(A8=0,0,'5 - Outputs'!L10+'5 - Outputs'!R10)","v":0},null,{"$f":"IF(A8=0,0,'5 - Outputs'!K10+'5 - Outputs'!N10+'5 - Outputs'!Q10+'5 - Outputs'!T10+'5 - Outputs'!X10+'5 - Outputs'!Z10+'5 - Outputs'!AA10+'5 - Outputs'!AB10)","v":0},null,{"$f":"IF(A8=0,0,(('5 - Outputs'!K10+('5 - Outputs'!K10*'1 - Cost Estimations'!S12))+'5 - Outputs'!N10+'5 - Outputs'!Q10+'5 - Outputs'!T10+'5 - Outputs'!X10+'5 - Outputs'!Z10+'5 - Outputs'!AA10+'5 - Outputs'!AB10))","v":0}]
{"$rows_left_out":20}
{"sheet":"7 - Calculations","index":8,"n_rows":32,"n_cols":3,"rows_kept":32,"cut":false,"hidden":false,"merged":[]}
[]
[]
[null,"Output","Explanation of Calculations"]
[]
[null,"Cost of a School Day","Funding per pupil provided by the borough divided by the number of school days in one school year"]
[null,"Percent Vulnerable","Total number of people in the affected area over 70 plus the number of disabled people under 70, divided by the total population of the affected area"]
[null,"Number of People Affected","Number of households affected multiplied by the average number of people per household in the affected area"]
[null,"Number of People Temporarily Relocated","Percentage of households requiring temporary accomodations (30%) during the 2007 floods multiplied by the number of people per household"]
{"$rows_left_out":25}
{"sheet":"8 - Sources","index":9,"n_rows":14,"n_cols":4,"rows_kept":14,"cut":false,"hidden":false,"merged":[]}
[]
[null,"Sources as Referenced",null,"Location"]
[]
[null,"EA 2007 Flood Report",null,"http://publications.environment-agency.gov.uk/pdf/SCHO1109BRJA-e-e.pdf "]
[]
[null,"Office for National Statistics",null,"http://www.neighbourhood.statistics.gov.uk/dissemination/"]
[]
[null,"Department for Education",null,"http://www.education.gov.uk/inyourarea/gors/gor_H.shtml "]
{"$rows_left_out":6}