{"text_format":"1","workbook":"xlsx","n_sheets":11,"sheets":["Scatter plot Graph &Radar Plots","User Interface for Radar Plot","Radar Plot Raw Data(DNT)","Rb Calculations","Rp Calculations","Rb Calculations (2)","Rp Calculations (2)","Rb Calculations (3)","Rp Calculations (3)","Rb Guides","Rp Guides"],"not_rendered":{"charts":5,"images":2,"macros":1,"external_links":0,"defined_names":7,"comments":0,"pivot_tables":0},"unopened":[],"bounds":{"document_bytes":16777216,"sheet_cells":100000,"rows_first":2000,"rows_last":500,"rows_between":2000,"halvings":0,"cell_chars":16384,"cell_head_chars":4096},"cells_cut":0,"cells_raw":0,"read":"whole","date_system":"1900"}

{"sheet":"Scatter plot Graph &Radar Plots","index":0,"n_rows":106,"n_cols":18,"rows_kept":106,"cut":false,"hidden":false,"merged":[[15,0,17,1],[40,0,41,2],[70,0,71,2],[102,0,103,2],[0,0,0,19],[3,0,5,1],[9,0,11,1],[31,0,32,2]]}
[]
[]
[]
["Risk factor values for location 1: (insert name)"]
[]
[]
{"$rows_left_out":101}
{"sheet":"User Interface for Radar Plot","index":1,"n_rows":13,"n_cols":10,"rows_kept":13,"cut":false,"hidden":false,"merged":[[3,0,6,1],[0,3,0,9],[7,0,8,1],[9,0,12,1]]}
[null,null,null,"Evaluation for Current Fire Safety Systems"]
[]
[null,null,"Inspected safety systems","Area 1","Area 2","Area 3","Area 4","Area 5","Area 6","Area 7"]
["Active Fire \nSafety Systems",null,"Detection System"]
[null,null,"Suppression System"]
[null,null,"Fire extinguisher"]
{"$rows_left_out":8}
{"sheet":"Radar Plot Raw Data(DNT)","index":2,"n_rows":11,"n_cols":23,"rows_kept":11,"cut":false,"hidden":false,"merged":[[2,13,2,14],[2,17,2,22],[2,1,2,4],[2,5,2,6],[2,7,2,10]]}
[]
[]
[null,"active fire safety applications",null,null,null,"passive fire safety",null,"evacuation system",null,null,null,null,null,"Scaling for Radar Plot Axes",null,null,null,"Data for radar plot on graph worksheet"]
["area","detection system ","suppresion system","fire extinguisher","hose stream","forced ventilation","natural ventilation","signs to exits","evacuation stairs","emergency lighting","emergency announcement",null,"current state of system","Scale for Passive Fire Safety And Evacuation Systems","Scale for Active Fire Safety Systems",null,"Area Name",{"$f":"'User Interface for Radar Plot'!D3","v":"Area 1"},{"$f":"'User Interface for Radar Plot'!E3","v":"Area 2"},{"$f":"'User Interface for Radar Plot'!F3","v":"Area 3"},{"$f":"'User Interface for Radar Plot'!G3","v":"Area 4"},"End Goal","No System Installation"]
["location 1",{"$f":"IFERROR(VLOOKUP('User Interface for Radar Plot'!$D$4,$M$5:$O$8,3,FALSE),\"\")","v":""},{"$f":"IFERROR(VLOOKUP('User Interface for Radar Plot'!$D$5,$M$5:$O$8,3,FALSE),\"\")","v":""},{"$f":"IFERROR(VLOOKUP('User Interface for Radar Plot'!$D$6,$M$5:$O$8,3,FALSE),\"\")","v":""},{"$f":"IFERROR(VLOOKUP('User Interface for Radar Plot'!$D$7,$M$5:$O$8,3,FALSE),\"\")","v":""},{"$f":"IFERROR(VLOOKUP('User Interface for Radar Plot'!$D$8,$M$5:$O$8,2,FALSE),\"\")","v":""},{"$f":"IFERROR(VLOOKUP('User Interface for Radar Plot'!$D$9,$M$5:$O$8,2,FALSE),\"\")","v":""},{"$f":"IFERROR(VLOOKUP('User Interface for Radar Plot'!$D$10,$M$5:$O$8,2,FALSE),\"\")","v":""},{"$f":"IFERROR(VLOOKUP('User Interface for Radar Plot'!$D$11,$M$5:$O$8,2,FALSE),\"\")","v":""},{"$f":"IFERROR(VLOOKUP('User Interface for Radar Plot'!$D$12,$M$5:$O$8,2,FALSE),\"\")","v":""},{"$f":"IFERROR(VLOOKUP('User Interface for Radar Plot'!$D$13,$M$5:$O$8,2,FALSE),\"\")","v":""},null,"Not Present",1,1,null,"Active Fire Safety",{"$f":"IFERROR(0.429*B5+0.226*C5+0.151*D5+0.194*E5,\"\")","v":""},{"$f":"IFERROR(0.429*B6+0.226*C6+0.151*D6+0.194*E6,\"\")","v":""},{"$f":"IFERROR(0.429*B7+0.226*C7+0.151*D7+0.194*E7,\"\")","v":""},{"$f":"IFERROR(0.429*B8+0.226*C8+0.151*D8+0.194*E8,\"\")","v":""},3,1]
["location 2",{"$f":"IFERROR(VLOOKUP('User Interface for Radar Plot'!$E$4,$M$5:$O$8,3,FALSE),\"\")","v":""},{"$f":"IFERROR(VLOOKUP('User Interface for Radar Plot'!$E$5,$M$5:$O$8,3,FALSE),\"\")","v":""},{"$f":"IFERROR(VLOOKUP('User Interface for Radar Plot'!$E$6,$M$5:$O$8,3,FALSE),\"\")","v":""},{"$f":"IFERROR(VLOOKUP('User Interface for Radar Plot'!$E$7,$M$5:$O$8,3,FALSE),\"\")","v":""},{"$f":"IFERROR(VLOOKUP('User Interface for Radar Plot'!$E$8,$M$5:$O$8,2,FALSE),\"\")","v":""},{"$f":"IFERROR(VLOOKUP('User Interface for Radar Plot'!$E$9,$M$5:$O$8,2,FALSE),\"\")","v":""},{"$f":"IFERROR(VLOOKUP('User Interface for Radar Plot'!$E$10,$M$5:$O$8,2,FALSE),\"\")","v":""},{"$f":"IFERROR(VLOOKUP('User Interface for Radar Plot'!$E$11,$M$5:$O$8,2,FALSE),\"\")","v":""},{"$f":"IFERROR(VLOOKUP('User Interface for Radar Plot'!$E$12,$M$5:$O$8,2,FALSE),\"\")","v":""},{"$f":"IFERROR(VLOOKUP('User Interface for Radar Plot'!$E$13,$M$5:$O$8,2,FALSE),\"\")","v":""},null,"Present, lack maintenance",1.3,1.5,null,"Passive Fire Safety ",{"$f":"IFERROR(0.5*F5+0.5*G5,\"\")","v":""},{"$f":"IFERROR(0.5*F6+0.5*G6,\"\")","v":""},{"$f":"IFERROR(0.5*F7+0.5*G7,\"\")","v":""},{"$f":"IFERROR(0.5*F8+0.5*G8,\"\")","v":""},1.7,1]
{"$rows_left_out":6}
{"sheet":"Rb Calculations","index":3,"n_rows":255,"n_cols":9,"rows_kept":255,"cut":false,"hidden":false,"merged":[[197,8,198,9],[196,8,196,9],[234,8,235,9],[233,8,233,9],[206,8,207,9],[205,8,205,9],[162,8,163,9],[161,8,161,9],[169,8,170,9],[168,8,168,9],[188,8,189,9],[187,8,187,9],[45,8,45,9],[46,8,47,9],[53,8,54,9],[52,8,52,9],[59,8,60,9],[58,8,58,9],[36,2,36,3],[34,2,34,4],[39,8,40,9],[38,8,38,9],[170,0,170,4],[128,2,128,4],[153,2,153,4],[136,0,136,1],[141,0,141,1],[146,0,146,1],[151,0,151,1],[156,0,156,1],[111,0,111,1],[116,0,116,1],[121,0,121,1],[126,0,126,1],[172,0,172,1],[177,0,177,1],[161,0,161,3],[162,0,162,3],[163,0,163,4],[168,0,168,3],[169,0,169,3],[131,0,131,1],[47,0,47,7],[45,0,45,4],[52,0,52,4],[53,0,53,3],[76,0,76,1],[81,0,81,1],[86,0,86,1],[91,0,91,1],[96,0,96,1],[101,0,101,1],[106,0,106,1],[59,0,59,2],[38,0,38,3],[39,0,39,3],[40,0,40,4],[46,0,46,3],[71,0,71,1],[54,0,54,7],[58,0,58,3],[60,0,60,4],[61,0,61,1],[66,0,66,1],[251,0,251,1],[233,0,233,5],[234,0,234,4],[235,0,235,4],[208,0,208,1],[218,0,218,1],[213,0,213,2],[223,0,223,1],[228,0,228,1],[236,0,236,1],[241,0,241,1],[246,0,246,1],[207,0,207,4],[205,0,205,5],[206,0,206,4],[196,0,196,3],[197,0,197,3],[198,0,198,4],[182,0,182,1],[187,0,187,3],[188,0,188,3],[189,0,189,4],[191,0,191,1]]}
[]
[]
[]
[]
[]
[]
{"$rows_left_out":250}
{"sheet":"Rp Calculations","index":4,"n_rows":112,"n_cols":9,"rows_kept":112,"cut":false,"hidden":false,"merged":[[95,8,95,9],[96,8,97,9],[19,2,19,4],[25,8,26,9],[31,8,31,9],[32,8,33,9],[38,8,38,9],[33,0,33,2],[24,8,24,9],[68,8,68,9],[61,8,61,9],[60,8,60,9],[64,8,64,9],[66,8,66,9],[67,8,67,9],[39,8,40,9],[56,8,56,9],[57,8,58,9],[32,0,32,3],[39,0,39,3],[38,0,38,3],[21,2,21,3],[96,0,96,4],[57,0,57,2],[59,0,59,1],[41,0,41,1],[46,0,46,1],[56,0,56,2],[24,0,24,3],[25,0,25,3],[26,0,26,4],[108,0,108,1],[12,0,12,1],[95,0,95,3],[97,0,97,2],[98,0,98,1],[103,0,103,1],[75,0,75,1],[74,0,74,3],[80,0,80,1],[85,0,85,1],[90,0,90,1],[64,0,64,1],[69,0,69,1],[40,0,40,4],[58,0,58,4],[51,0,51,1]]}
[]
[]
[]
[]
[]
[]
{"$rows_left_out":107}
{"sheet":"Rb Calculations (2)","index":5,"n_rows":255,"n_cols":9,"rows_kept":255,"cut":false,"hidden":false,"merged":[[251,0,251,1],[234,0,234,4],[234,8,235,9],[235,0,235,4],[236,0,236,1],[241,0,241,1],[246,0,246,1],[233,8,233,9],[205,0,205,5],[205,8,205,9],[206,0,206,4],[206,8,207,9],[207,0,207,4],[208,0,208,1],[213,0,213,2],[218,0,218,1],[223,0,223,1],[228,0,228,1],[233,0,233,5],[191,0,191,1],[196,0,196,3],[196,8,196,9],[197,0,197,3],[197,8,198,9],[198,0,198,4],[188,0,188,3],[188,8,189,9],[189,0,189,4],[162,0,162,3],[162,8,163,9],[163,0,163,4],[168,0,168,3],[168,8,168,9],[169,0,169,3],[169,8,170,9],[170,0,170,4],[172,0,172,1],[177,0,177,1],[182,0,182,1],[187,0,187,3],[187,8,187,9],[161,8,161,9],[121,0,121,1],[126,0,126,1],[128,2,128,4],[131,0,131,1],[136,0,136,1],[141,0,141,1],[146,0,146,1],[151,0,151,1],[153,2,153,4],[156,0,156,1],[161,0,161,3],[116,0,116,1],[61,0,61,1],[66,0,66,1],[71,0,71,1],[76,0,76,1],[81,0,81,1],[86,0,86,1],[91,0,91,1],[96,0,96,1],[101,0,101,1],[106,0,106,1],[111,0,111,1],[59,0,59,3],[59,8,60,9],[60,0,60,4],[45,0,45,4],[45,8,45,9],[46,0,46,3],[46,8,47,9],[47,0,47,7],[52,0,52,4],[52,8,52,9],[53,0,53,3],[53,8,54,9],[54,0,54,7],[58,0,58,3],[58,8,58,9],[34,2,34,4],[36,2,36,3],[38,0,38,3],[38,8,38,9],[39,0,39,3],[39,8,40,9],[40,0,40,4]]}
[]
[]
[]
[]
[]
[]
{"$rows_left_out":250}
{"sheet":"Rp Calculations (2)","index":6,"n_rows":112,"n_cols":9,"rows_kept":112,"cut":false,"hidden":false,"merged":[[98,0,98,1],[103,0,103,1],[108,0,108,1],[90,0,90,1],[95,0,95,3],[95,8,95,9],[96,0,96,4],[96,8,97,9],[97,0,97,2],[68,8,68,9],[69,0,69,1],[74,0,74,3],[75,0,75,1],[80,0,80,1],[85,0,85,1],[67,8,67,9],[56,0,56,2],[56,8,56,9],[57,0,57,2],[57,8,58,9],[58,0,58,4],[59,0,59,1],[60,8,60,9],[61,8,61,9],[64,0,64,1],[64,8,64,9],[66,8,66,9],[51,0,51,1],[31,8,31,9],[32,0,32,3],[32,8,33,9],[33,0,33,2],[38,0,38,3],[38,8,38,9],[39,0,39,3],[39,8,40,9],[40,0,40,4],[41,0,41,1],[46,0,46,1],[25,0,25,3],[25,8,26,9],[26,0,26,4],[12,0,12,1],[19,2,19,4],[21,2,21,3],[24,0,24,3],[24,8,24,9]]}
[]
[]
[]
[]
[]
[]
{"$rows_left_out":107}
{"sheet":"Rb Calculations (3)","index":7,"n_rows":255,"n_cols":9,"rows_kept":255,"cut":false,"hidden":false,"merged":[[251,0,251,1],[234,0,234,4],[234,8,235,9],[235,0,235,4],[236,0,236,1],[241,0,241,1],[246,0,246,1],[233,8,233,9],[205,0,205,5],[205,8,205,9],[206,0,206,4],[206,8,207,9],[207,0,207,4],[208,0,208,1],[213,0,213,2],[218,0,218,1],[223,0,223,1],[228,0,228,1],[233,0,233,5],[191,0,191,1],[196,0,196,3],[196,8,196,9],[197,0,197,3],[197,8,198,9],[198,0,198,4],[188,0,188,3],[188,8,189,9],[189,0,189,4],[162,0,162,3],[162,8,163,9],[163,0,163,4],[168,0,168,3],[168,8,168,9],[169,0,169,3],[169,8,170,9],[170,0,170,4],[172,0,172,1],[177,0,177,1],[182,0,182,1],[187,0,187,3],[187,8,187,9],[161,8,161,9],[121,0,121,1],[126,0,126,1],[128,2,128,4],[131,0,131,1],[136,0,136,1],[141,0,141,1],[146,0,146,1],[151,0,151,1],[153,2,153,4],[156,0,156,1],[161,0,161,3],[116,0,116,1],[61,0,61,1],[66,0,66,1],[71,0,71,1],[76,0,76,1],[81,0,81,1],[86,0,86,1],[91,0,91,1],[96,0,96,1],[101,0,101,1],[106,0,106,1],[111,0,111,1],[59,0,59,3],[59,8,60,9],[60,0,60,4],[45,0,45,4],[45,8,45,9],[46,0,46,3],[46,8,47,9],[47,0,47,7],[52,0,52,4],[52,8,52,9],[53,0,53,3],[53,8,54,9],[54,0,54,7],[58,0,58,3],[58,8,58,9],[34,2,34,4],[36,2,36,3],[38,0,38,3],[38,8,38,9],[39,0,39,3],[39,8,40,9],[40,0,40,4]]}
[]
[]
[]
[]
[]
[]
{"$rows_left_out":250}
{"sheet":"Rp Calculations (3)","index":8,"n_rows":112,"n_cols":9,"rows_kept":112,"cut":false,"hidden":false,"merged":[[98,0,98,1],[103,0,103,1],[108,0,108,1],[90,0,90,1],[95,0,95,3],[95,8,95,9],[96,0,96,4],[96,8,97,9],[97,0,97,2],[68,8,68,9],[69,0,69,1],[74,0,74,3],[75,0,75,1],[80,0,80,1],[85,0,85,1],[67,8,67,9],[56,0,56,2],[56,8,56,9],[57,0,57,2],[57,8,58,9],[58,0,58,4],[59,0,59,1],[60,8,60,9],[61,8,61,9],[64,0,64,1],[64,8,64,9],[66,8,66,9],[51,0,51,1],[31,8,31,9],[32,0,32,3],[32,8,33,9],[33,0,33,2],[38,0,38,3],[38,8,38,9],[39,0,39,3],[39,8,40,9],[40,0,40,4],[41,0,41,1],[46,0,46,1],[25,0,25,3],[25,8,26,9],[26,0,26,4],[12,0,12,1],[19,2,19,4],[21,2,21,3],[24,0,24,3],[24,8,24,9]]}
[]
[]
[]
[]
[]
[]
{"$rows_left_out":107}
{"sheet":"Rb Guides","index":9,"n_rows":21,"n_cols":131,"rows_kept":21,"cut":false,"hidden":false,"merged":[[1,113,1,122],[1,123,1,130],[0,113,0,130],[9,89,14,89],[15,89,15,90],[0,89,0,90],[7,91,7,94],[0,101,0,102],[7,89,8,90],[20,89,20,90],[16,89,16,90],[17,89,17,90],[18,89,18,90],[19,89,19,90],[3,58,3,59],[3,60,3,61],[3,62,3,63],[1,76,1,77],[3,50,3,51],[3,54,3,55],[3,56,3,57],[3,52,3,53],[1,78,1,79],[1,80,1,81],[0,76,0,81],[2,40,2,47],[2,48,2,53],[1,28,1,48],[2,54,2,57],[2,58,2,63],[3,28,3,29],[2,24,3,25],[2,26,3,27],[2,28,2,31],[3,30,3,31],[3,40,3,41],[3,42,3,43],[3,44,3,45],[3,46,3,47],[3,48,3,49],[3,32,3,33],[3,34,3,35],[3,36,3,37],[2,32,2,39],[3,38,3,39],[1,24,1,27],[1,54,1,63],[0,0,0,1],[0,7,0,8],[0,69,0,70],[0,14,0,18],[0,24,0,63]]}
["Mobile Fire Load factor (Qm)",null,null,null,null,null,null,"Flammability factor of the mobile fire load (μ)",null,null,null,null,null,null,"immobile fire load factor (Qi)",null,null,null,null,null,null,null,null,null,"Fire Source Factor",null,null,null,null,null,null,null,null,null,null,null,null,null,null,null,null,null,null,null,null,null,null,null,null,null,null,null,null,null,null,null,null,null,null,null,null,null,null,null,null,null,null,null,null,"building area factor",null,null,null,null,null,null,"Confinement Factor (C )",null,null,null,null,null,null,null,null,null,null,null,null,"Building fireproof rating factor (W)",null,null,null,null,null,null,null,null,null,null,null,"factor on reduction of fire spreading (Ri)",null,null,null,null,null,null,null,null,null,null,null,"Factor on firefighting capability of the fire department & firefighting equiptment in the building"]
["Mobile fire load (kg/m2)","Qm",null,null,null,null,null,"Major flammable material type","μ",null,null,null,null,null,"Scenario","support material","ceiling material","wall material","Qi",null,null,null,null,null,"Human Source Fire",null,null,null,"Electrical Fire Source",null,null,null,null,null,null,null,null,null,null,null,null,null,null,null,null,null,null,null,null,null,null,null,null,null,"Fuel Source",null,null,null,null,null,null,null,null,null,null,null,null,null,null,"building area (m2)","S",null,null,null,null,null,"Design of ventilation system",null,"usability of ventilation system",null,"choice of fireproof material",null,null,null,null,null,null,null,null,"fireproof rating of the building","W",null,null,null,null,null,null,null,null,null,null,"Scenario","Ri",null,null,null,null,null,null,null,null,null,null,"Lo",null,null,null,null,null,null,null,null,null,"Li"]
["0-15 kg/m2",1,null,null,null,null,null,"wood furniture, flooring, etc.",1,null,null,null,null,null,1,"Concrete, bricks, steel","concrete, steel","concrete, bricks, steel",0,null,null,null,null,null,"People Smoking",null,"Prohibited Behavior Related to Fire",null,"Electric Wirings",null,null,null,"Lighting Equipment",null,null,null,null,null,null,null,"Electric Applicances",null,null,null,null,null,null,null,"Power Transformation Equipment",null,null,null,null,null,"Coal",null,null,null,"Flammable and combustible fuels",null,null,null,null,null,null,null,null,null,null,"5,000-8,000",1,null,null,null,null,null,"reasonable",1,"complete and usable",1,"up to standard",1,null,null,null,null,null,null,null,"level 1",2,null,null,null,null,null,null,null,null,null,null,"Much flammable goods piled loosely across the room, help spread the fire",1,null,null,null,null,null,null,null,null,null,null,"Fire department equipment (0.276)","numerical conversion","Firefighting experience of the fire department (0.176)","numerical conversion","Fire lane availability (0.144)","numerical conversion","Outdoor fire hydrant (0.255)","numerical conversion","Nearest fire station response time (0.151)","numerical conversion","Fire detection system (0.429)","numerical conversion","Sprinkler system (0.226)","numerical conversion","Indoor fire hydrant (0.194)","numerical conversion","Fire Extinguisher (0.151)","numerical conversion"]
["16-30 kg/m2",1.2,null,null,null,null,null,"fiber panel, polyester mattress",1.2,null,null,null,null,null,2,"steel","wood","concrete, steel ",0.2,null,null,null,null,null,null,null,null,null,"maintenance schedule",null,"installation condition",null,"equipment up to standard",null,"heat dissipation condition",null,"flammable materials in proximity",null,"spotlight continous usage time",null,"equiptment up to standard",null,"heat dissipation condition",null,"flammable materials in proximity",null,"grounding condition",null,"equipment up to standard",null,"appearance of electric sparks",null,"grounding conditions",null,"presence",null,"protection of conveyor belt",null,"presence",null,"protection",null,"containment",null,null,null,null,null,null,"8,001-12,000",1.2,null,null,null,null,null,"relatively lreasonable",1.5,"relatively complete and usable",1.5,"relatively up to standard",1.5,null,null,null,null,null,null,null,"level 2",1.8,null,null,null,null,null,null,null,null,null,null,"Moderately flammable goods piled loosely",1.3,null,null,null,null,null,null,null,null,null,null,"advanced",3,"good",3,"clear",3,"completely usable",3,"0-30 minutes",3,"completely usable",3,"completely usable",3,"completely usable",3,"completely usable",3]
["31-60 kg/m2",1.4,null,null,null,null,null,"cotton, linen, rubber, polyethylene",1.5,null,null,null,null,null,3,"wood, steel","wood","concrete, bricks ",0.4,null,null,null,null,null,"Very Rarely ",1,"very rarely ",1,"very often",1,"very good ",1,"all up to standard",1,"very good",1,"none",1,"Less than 6 hours",1,"all up to standard",1,"very good",1,"none",1,"very good",1,"all up to standard",1,"none",1,"all up to standard",1,"no",1,"very good",1,"no ",1,"very good",1,"very good",1,null,null,null,null,null,"12001-17000",1.5,null,null,null,null,null,"partially reasonable",2.5,"partially usable",2.5,"partially up to standard",2.5,null,null,null,null,null,null,null,"level 3",1.2,null,null,null,null,null,null,null,null,null,null,"25%-50% of the goods not easily flammable, good heat dissipation condition, area smaller than 3000 m2",1.6,null,null,null,null,null,null,null,null,null,null,"relatively advanced",2.5,"relatively good",2.5,"relatively clear",2.5,"relatively usable",2.5,"31-45 minutes",2.5,"relatively usable",2.5,"relatively usable",2.5,"relatively usable",2.5,"relatively usable",2.5]
["61-120 kg/m2",1.6,null,null,null,null,null,"polystyrene, floor wax, curtain, sofa, butanol, diesel",2,null,null,null,null,null,4,"wood ","wood","wood, tiles, sheet metals",0.6,null,null,null,null,null,"Not often",1.5,"not often",1.5,"on schedule",1.5,"good",1.5,"most up to standard",1.5,"relatively good",1.5,"few",1.5,"7 to 8 hours",1.5,"most up to standard",1.5,"relatively good",1.5,"few",1.5,"relatively good",1.5,"most up to standard",1.5,"few",1.5,"most up to standard",1.5,"yes",3,"relatively good",1.5,"yes",3,"relatively good",1.5,"relatively good",1.5,null,null,null,null,null,"17001-23000",1.8,null,null,null,null,null,"not reasonable",3,"not usable",3,"not up to standard",3,null,null,null,null,null,null,null,"level 4",1,null,null,null,null,null,null,null,null,null,null,"Goods packed in containers, hard to ignite",2,null,null,null,null,null,null,null,null,null,null,"normal",1.5,"normal",1.5,"partially clear",1.5,"partially usable",1.5,"46-55 minutes",1.5,"partially usable",1.5,"partially usable",1.5,"partially usable",1.5,"partially usable",1.5]
{"$rows_left_out":16}
{"sheet":"Rp Guides","index":10,"n_rows":8,"n_cols":69,"rows_kept":8,"cut":false,"hidden":false,"merged":[[0,0,0,1],[0,4,0,5],[1,13,1,14],[1,11,1,12],[1,65,1,66],[1,63,1,64],[1,36,1,43],[1,30,1,35],[1,15,1,16],[0,11,0,16],[1,67,1,68],[0,63,0,68],[0,30,0,43],[2,42,2,43],[2,40,2,41],[2,38,2,39],[2,36,2,37],[2,34,2,35],[2,32,2,33],[2,30,2,31]]}
["guide for smoke toxicity factor (T)",null,null,null,"User characteristic factor (f)",null,null,null,null,null,null,"Automatic fire alarm factor (K)",null,null,null,null,null,null,null,null,null,null,null,null,null,null,null,null,null,null,"evacuation capacity factor ( E )",null,null,null,null,null,null,null,null,null,null,null,null,null,null,null,null,null,null,null,null,null,null,null,null,null,null,null,null,null,null,null,null,"ventilation and smoke extraction factor (H)"]
["Flammable Materials","T",null,null,"Building types","f",null,null,null,null,null,"Design of fire detection system",null,"Usability of the fire detection system",null,"system approval ",null,null,null,null,null,null,null,null,null,null,null,null,null,null,"evacuation route (the means of egress)",null,null,null,null,null,"evacuation equiptment",null,null,null,null,null,null,null,null,null,null,null,null,null,null,null,null,null,null,null,null,null,null,null,null,null,null,"design of smoke extraction system",null,"usability of the smoke extraction system",null,"type of smoke extraction and ventilation"]
["Non applicable/empty",0,null,null,"Office building, station, airport, stadium",1,null,null,null,null,null,"Non applicable/empty",null,"non applicable/empty",null,"yes",1.7,null,null,null,null,null,null,null,null,null,null,null,null,null,"Distance to exits",null,"clearance of the route",null,"Design of the exits",null,"Signs to exits",null,"design of the evacuation stairs",null,"emergency lighting system",null,"emergency announcement system",null,null,null,null,null,null,null,null,null,null,null,null,null,null,null,null,null,null,null,null,"non applicable/empty",0,"non applicable/empty",0,null,0]
["Ethanol, natural gas",1,null,null,"shopping mall, library, theater, museum, restaurant",1.5,null,null,null,null,null,"Reasonable",1.7,"complete and usable",1.7,"no",1,null,null,null,null,null,null,null,null,null,null,null,null,null,"non applicable/empty",null,"non applicable/empty",null,"non applicable/empty",null,"non applicable/empty",null,"non applicable/empty",null,"non applicable/empty",null,"non applicable/empty",null,null,null,null,null,null,null,null,null,null,null,null,null,null,null,null,null,null,null,null,"reasonable",1.7,"complete and usable ",1.7,"forced",1.7]
["Wood, cotton, paper",1.2,null,null,"apartment, house",2,null,null,null,null,null,"Relatively reasonable",1.5,"relatively complete and usable",1.5,null,null,null,null,null,null,null,null,null,null,null,null,null,null,null,"up to standard",1.7,"clear ",1.7,"reasonable",1.7,"effective",1.7,"reasonable ",1.7,"complete and usable",1.7,"effective",1.7,null,null,null,null,null,null,null,null,null,null,null,null,null,null,null,null,null,null,null,"relatively reasonable",1.5,"relatively complete and usable ",1.5,"natural",1.5]
["Gasoline, kerosene, diesel, cloths, melamine chipboard",1.5,null,null,"industrial setting",1.75,null,null,null,null,null,"Partially reasonable",1.3,"partially usable",1.3,null,null,null,null,null,null,null,null,null,null,null,null,null,null,null,"relatively up to standard",1.5,"relatively clear ",1.5,"relatively reasonable",1.5,"relatively effective",1.5,"relatively reasonable ",1.5,"relatively complete and usable",1.5,"relatively effective",1.5,null,null,null,null,null,null,null,null,null,null,null,null,null,null,null,null,null,null,null,"partially reasonable",1.3,"partially usable",1.3,"none",1]
{"$rows_left_out":2}